{"text_format":"1","workbook":"xlsx","n_sheets":4,"sheets":["Form C-13CPM Instructions","Controls Chart Data","Earnings Data Input","Progress Chart"],"not_rendered":{"charts":1,"images":4,"macros":1,"external_links":0,"defined_names":3,"comments":2,"pivot_tables":0},"unopened":[],"bounds":{"document_bytes":16777216,"sheet_cells":100000,"rows_first":2000,"rows_last":500,"rows_between":2000,"halvings":0,"cell_chars":16384,"cell_head_chars":4096},"cells_cut":0,"cells_raw":0,"read":"whole","date_system":"1900"}

{"sheet":"Form C-13CPM Instructions","index":0,"n_rows":58,"n_cols":3,"rows_kept":58,"cut":false,"hidden":false,"merged":[[57,0,57,11],[51,2,51,11],[33,2,33,11],[34,0,34,11],[43,2,43,11],[36,0,36,11],[39,2,39,11],[41,2,41,11],[46,0,46,11],[45,2,45,11],[54,0,54,11],[50,0,50,11],[48,0,48,11],[53,0,53,11],[49,2,49,11],[18,0,18,11],[17,0,17,11],[19,0,19,11],[22,0,22,11],[44,0,44,11],[42,0,42,11],[40,0,40,11],[27,2,27,11],[23,2,23,11],[30,0,30,11],[31,2,31,11],[32,0,32,11],[29,2,29,11],[13,0,13,11],[12,0,12,11],[21,0,21,11],[28,0,28,11],[24,0,24,11],[25,2,25,11],[26,0,26,11],[0,0,0,11],[2,0,2,11],[4,0,4,11],[6,0,6,11],[1,0,1,11],[3,0,3,11],[5,0,5,11],[7,0,7,11],[56,0,56,11],[55,0,55,11],[47,2,47,11],[35,2,35,11],[9,0,9,11],[11,0,11,11],[20,0,20,11],[16,0,16,11],[8,0,8,11],[37,2,37,11],[38,0,38,11],[10,0,10,11],[15,0,15,11],[14,0,14,11],[52,0,52,11]]}
[]
["INSTRUCTIONS FOR COMPLETING THE CONTRACTOR'S PROGRESS EARNINGS SCHEDULE (FORM C-13CPM)"]
[]
["Form C-13CPM shall be used by the Contractor to submit its Progress Earnings Schedule as specified in the Progress Schedule Specifications for Category IV, V, and Design-Build projects.  Form C-13CPM should also be used for other projects when the Progress Schedule is cost-loaded at the Contractor's discretion. The Progress Earnings Schedule shall define the Contractor's anticipated and actual progress for each month relative to the Total Contract Value. The anticipated progress percent complete will be based on the anticipated cumulative earnings for work-in-place as of the Contractor's progress estimate dates as defined in Section 109.8(a) of the Specifications. The Contractor shall submit with the Progress Earnings Schedule, an Activity Cost-loading Report (ACR) showing the budgeted units and cost for each activity in the Progress Schedule that is associated with a bid item as shown in the Contract Schedule of Items. When a bid item is associated with more than one activity, the ACR shall list the bid item, activities, and the proportionate units and cost assigned to each activity.      "]
[]
["The C-13CPM form contains macros and certain advanced functions that are availble in the Analysis ToolPak. The application macro security settings must be set on \"Enable\" for the form to work properly. For Microsoft Excel 2003 users, prior to completing the form, click on Tools, then click on Macros, then click on Security, an then specify \"Medium\". Also, click on Tools, then click on Add-ins, then make sure that the Analysis ToolPak and Analysis ToolPak - VBA boxes are checked. For Microsoft Excel 2007 and above users, prior to completing the form, click on Developer tab in the Main menu, then click on the Macro Security link in the Code section, and then specify \"Enable all macros\"."]
[]
["CONTROLS CHART DATA: Complete all contract and project information fields as indicated on the Controls Chart Data form as follows. All shaded cells are locked and automatically populated:"]
[]
["CONTRACT NTP DATE: Enter the Contract Notice to Proceed (NTP) Date as defined in the Contract or as approved by the Engineer."]
[]
["CONTRACT FIXED COMPLETION DATE: Enter the Contract Fixed Completion Date as defined in the Contract or as subsequently approved by a Work Order."]
[]
["PROJECTED COMPLETION DATE: Enter the calculated project completion date as shown in the Baseline Progress Schedule or the current Progress Schedule Update, whichever is later."]
[]
{"$rows_left_out":44}
{"sheet":"Controls Chart Data","index":1,"n_rows":110,"n_cols":15,"rows_kept":110,"cut":false,"hidden":false,"merged":[[5,13,5,14],[3,6,9,9],[8,10,8,12],[3,2,3,5],[6,2,6,5],[9,10,9,12],[4,2,4,5],[5,2,5,5],[4,10,4,12],[5,10,5,12],[6,10,6,12],[11,4,13,4],[11,5,13,5],[11,6,13,6],[11,8,13,8],[11,9,13,9],[1,0,1,14],[3,10,3,12],[7,13,7,14],[8,13,8,14],[3,13,3,14],[4,13,4,14],[8,2,8,5],[7,10,7,12],[3,0,3,1],[6,13,6,14],[4,0,4,1],[5,0,5,1],[7,0,7,1],[8,0,8,1],[7,2,7,5],[6,0,6,1],[11,13,13,13],[109,12,109,13],[0,0,0,14],[2,0,2,14],[107,0,107,1],[107,12,107,14],[11,1,13,1],[9,13,9,14],[11,10,13,10],[102,0,102,14],[11,0,13,0],[108,12,108,14],[11,2,13,2],[11,14,13,14],[11,3,13,3],[11,7,13,7],[11,12,13,12],[109,0,109,1],[107,2,107,7],[107,10,107,11],[108,10,108,11],[109,10,109,11],[109,2,109,7],[108,0,108,1],[108,2,108,7],[107,8,109,9],[11,11,13,11]]}
["Enter Company Name Here"]
["CONTRACTOR'S PROGRESS EARNINGS SCHEDULE (FORM C-13CPM)"]
["Enter Submission Number and Data Date Here (i.e. Baseline #01, DD: 9-01-19)"]
["CONTRACT ID. NO.:",null,null,null,null,null,null,null,null,null,"CONTRACT NTP DATE:"]
["PROJECT NO.:",null,null,null,null,null,null,null,null,null,"CONTRACT COMPLETION DATE:"]
["FHWA PROJECT NO.:",null,null,null,null,null,null,null,null,null,"PROJECTED COMPLETION DATE:"]
["PROJECT NAME:",null,null,null,null,null,null,null,null,null,"ORIGINAL TOTAL CONTRACT VALUE:"]
["ROUTE:",null,null,null,null,null,null,null,null,null,"ADJUSTED TOTAL CONTRACT VALUE:"]
["CITY/COUNTY:",null,null,null,null,null,null,null,null,null,"FIRST PROGRESS ESTIMATE DATE:"]
[null,null,null,null,null,null,null,null,null,null,"CURRENT PROGRESS ESTIMATE DATE:"]
[]
["MONTHLY PROGRESS ESTIMATE DATE","BASELINE MONTHLY     EARNINGS      (EARLY)","BASELINE CUMULATIVE            EARNINGS           (EARLY)","BASELINE PERCENT COMPLETE (EARLY)","BASELINE MONTHLY         EARNINGS         (LATE)","BASELINE CUMULATIVE                   EARNINGS            (LATE)","BASELINE PERCENT COMPLETE (LATE)","ACTUAL MONTHLY                 EARNINGS","ACTUAL CUMULATIVE EARNINGS","ACTUAL PROGRESS PERCENT COMPLETE","CURRENT PROJECTED MONTHLY       EARNINGS","CURRENT CUMULATIVE AT COMPLETION     EARNINGS","CURRENT/ PROJECTED PROGRESS PERCENT COMPLETE","PROGRESS VARIANCE (CURRENT % - BASELINE %)","SCHEDULE PERFORMANCE INDEX\n(SPI)"]
[]
[]
[{"$f":"IF($N$4=\"\",\"\",$N$4)","v":""},"Notice to Proceed Date",null,{"$f":"IF($A15=\"\",\"\",0)","v":""},{"$f":"IF($A15=\"\",\"\",0)","v":""},"","","","","","","","","",""]
{"$rows_left_out":96}
{"sheet":"Earnings Data Input","index":2,"n_rows":100,"n_cols":87,"rows_kept":100,"cut":false,"hidden":false,"merged":[[11,0,11,1],[0,0,0,4],[7,0,7,4],[12,0,12,1],[13,0,13,1],[1,0,1,1],[2,0,2,1],[3,0,3,1],[6,0,6,1],[4,0,4,1],[5,0,5,1],[8,0,8,1],[9,0,9,1],[10,0,10,1]]}
["BASELINE MONTHLY COST (EARNINGS) DATA "]
["Payment Estimate Dates",null,{"$f":"IF($A16=\"\",\"\",$A16)","v":""},{"$f":"IF($A$16=\"\",\"\",IF($A17<=MAX($A$16:$A$100),$A17,IF(AND(C$2=MAX($A$16:$A$100),$A18=\"\"),\"Total\",\"\")))","v":""},{"$f":"IF($A$16=\"\",\"\",IF($A18<=MAX($A$16:$A$100),$A18,IF(AND(D$2=MAX($A$16:$A$100),$A19=\"\"),\"Total\",\"\")))","v":""},{"$f":"IF($A$16=\"\",\"\",IF($A19<=MAX($A$16:$A$100),$A19,IF(AND(E$2=MAX($A$16:$A$100),$A20=\"\"),\"Total\",\"\")))","v":""},{"$f":"IF($A$16=\"\",\"\",IF($A20<=MAX($A$16:$A$100),$A20,IF(AND(F$2=MAX($A$16:$A$100),$A21=\"\"),\"Total\",\"\")))","v":""},{"$f":"IF($A$16=\"\",\"\",IF($A21<=MAX($A$16:$A$100),$A21,IF(AND(G$2=MAX($A$16:$A$100),$A22=\"\"),\"Total\",\"\")))","v":""},{"$f":"IF($A$16=\"\",\"\",IF($A22<=MAX($A$16:$A$100),$A22,IF(AND(H$2=MAX($A$16:$A$100),$A23=\"\"),\"Total\",\"\")))","v":""},{"$f":"IF($A$16=\"\",\"\",IF($A23<=MAX($A$16:$A$100),$A23,IF(AND(I$2=MAX($A$16:$A$100),$A24=\"\"),\"Total\",\"\")))","v":""},{"$f":"IF($A$16=\"\",\"\",IF($A24<=MAX($A$16:$A$100),$A24,IF(AND(J$2=MAX($A$16:$A$100),$A25=\"\"),\"Total\",\"\")))","v":""},{"$f":"IF($A$16=\"\",\"\",IF($A25<=MAX($A$16:$A$100),$A25,IF(AND(K$2=MAX($A$16:$A$100),$A26=\"\"),\"Total\",\"\")))","v":""},{"$f":"IF($A$16=\"\",\"\",IF($A26<=MAX($A$16:$A$100),$A26,IF(AND(L$2=MAX($A$16:$A$100),$A27=\"\"),\"Total\",\"\")))","v":""},{"$f":"IF($A$16=\"\",\"\",IF($A27<=MAX($A$16:$A$100),$A27,IF(AND(M$2=MAX($A$16:$A$100),$A28=\"\"),\"Total\",\"\")))","v":""},{"$f":"IF($A$16=\"\",\"\",IF($A28<=MAX($A$16:$A$100),$A28,IF(AND(N$2=MAX($A$16:$A$100),$A29=\"\"),\"Total\",\"\")))","v":""},{"$f":"IF($A$16=\"\",\"\",IF($A29<=MAX($A$16:$A$100),$A29,IF(AND(O$2=MAX($A$16:$A$100),$A30=\"\"),\"Total\",\"\")))","v":""},{"$f":"IF($A$16=\"\",\"\",IF($A30<=MAX($A$16:$A$100),$A30,IF(AND(P$2=MAX($A$16:$A$100),$A31=\"\"),\"Total\",\"\")))","v":""},{"$f":"IF($A$16=\"\",\"\",IF($A31<=MAX($A$16:$A$100),$A31,IF(AND(Q$2=MAX($A$16:$A$100),$A32=\"\"),\"Total\",\"\")))","v":""},{"$f":"IF($A$16=\"\",\"\",IF($A32<=MAX($A$16:$A$100),$A32,IF(AND(R$2=MAX($A$16:$A$100),$A33=\"\"),\"Total\",\"\")))","v":""},{"$f":"IF($A$16=\"\",\"\",IF($A33<=MAX($A$16:$A$100),$A33,IF(AND(S$2=MAX($A$16:$A$100),$A34=\"\"),\"Total\",\"\")))","v":""},{"$f":"IF($A$16=\"\",\"\",IF($A34<=MAX($A$16:$A$100),$A34,IF(AND(T$2=MAX($A$16:$A$100),$A35=\"\"),\"Total\",\"\")))","v":""},{"$f":"IF($A$16=\"\",\"\",IF($A35<=MAX($A$16:$A$100),$A35,IF(AND(U$2=MAX($A$16:$A$100),$A36=\"\"),\"Total\",\"\")))","v":""},{"$f":"IF($A$16=\"\",\"\",IF($A36<=MAX($A$16:$A$100),$A36,IF(AND(V$2=MAX($A$16:$A$100),$A37=\"\"),\"Total\",\"\")))","v":""},{"$f":"IF($A$16=\"\",\"\",IF($A37<=MAX($A$16:$A$100),$A37,IF(AND(W$2=MAX($A$16:$A$100),$A38=\"\"),\"Total\",\"\")))","v":""},{"$f":"IF($A$16=\"\",\"\",IF($A38<=MAX($A$16:$A$100),$A38,IF(AND(X$2=MAX($A$16:$A$100),$A39=\"\"),\"Total\",\"\")))","v":""},{"$f":"IF($A$16=\"\",\"\",IF($A39<=MAX($A$16:$A$100),$A39,IF(AND(Y$2=MAX($A$16:$A$100),$A40=\"\"),\"Total\",\"\")))","v":""},{"$f":"IF($A$16=\"\",\"\",IF($A40<=MAX($A$16:$A$100),$A40,IF(AND(Z$2=MAX($A$16:$A$100),$A41=\"\"),\"Total\",\"\")))","v":""},{"$f":"IF($A$16=\"\",\"\",IF($A41<=MAX($A$16:$A$100),$A41,IF(AND(AA$2=MAX($A$16:$A$100),$A42=\"\"),\"Total\",\"\")))","v":""},{"$f":"IF($A$16=\"\",\"\",IF($A42<=MAX($A$16:$A$100),$A42,IF(AND(AB$2=MAX($A$16:$A$100),$A43=\"\"),\"Total\",\"\")))","v":""},{"$f":"IF($A$16=\"\",\"\",IF($A43<=MAX($A$16:$A$100),$A43,IF(AND(AC$2=MAX($A$16:$A$100),$A44=\"\"),\"Total\",\"\")))","v":""},{"$f":"IF($A$16=\"\",\"\",IF($A44<=MAX($A$16:$A$100),$A44,IF(AND(AD$2=MAX($A$16:$A$100),$A45=\"\"),\"Total\",\"\")))","v":""},{"$f":"IF($A$16=\"\",\"\",IF($A45<=MAX($A$16:$A$100),$A45,IF(AND(AE$2=MAX($A$16:$A$100),$A46=\"\"),\"Total\",\"\")))","v":""},{"$f":"IF($A$16=\"\",\"\",IF($A46<=MAX($A$16:$A$100),$A46,IF(AND(AF$2=MAX($A$16:$A$100),$A47=\"\"),\"Total\",\"\")))","v":""},{"$f":"IF($A$16=\"\",\"\",IF($A47<=MAX($A$16:$A$100),$A47,IF(AND(AG$2=MAX($A$16:$A$100),$A48=\"\"),\"Total\",\"\")))","v":""},{"$f":"IF($A$16=\"\",\"\",IF($A48<=MAX($A$16:$A$100),$A48,IF(AND(AH$2=MAX($A$16:$A$100),$A49=\"\"),\"Total\",\"\")))","v":""},{"$f":"IF($A$16=\"\",\"\",IF($A49<=MAX($A$16:$A$100),$A49,IF(AND(AI$2=MAX($A$16:$A$100),$A50=\"\"),\"Total\",\"\")))","v":""},{"$f":"IF($A$16=\"\",\"\",IF($A50<=MAX($A$16:$A$100),$A50,IF(AND(AJ$2=MAX($A$16:$A$100),$A51=\"\"),\"Total\",\"\")))","v":""},{"$f":"IF($A$16=\"\",\"\",IF($A51<=MAX($A$16:$A$100),$A51,IF(AND(AK$2=MAX($A$16:$A$100),$A52=\"\"),\"Total\",\"\")))","v":""},{"$f":"IF($A$16=\"\",\"\",IF($A52<=MAX($A$16:$A$100),$A52,IF(AND(AL$2=MAX($A$16:$A$100),$A53=\"\"),\"Total\",\"\")))","v":""},{"$f":"IF($A$16=\"\",\"\",IF($A53<=MAX($A$16:$A$100),$A53,IF(AND(AM$2=MAX($A$16:$A$100),$A54=\"\"),\"Total\",\"\")))","v":""},{"$f":"IF($A$16=\"\",\"\",IF($A54<=MAX($A$16:$A$100),$A54,IF(AND(AN$2=MAX($A$16:$A$100),$A55=\"\"),\"Total\",\"\")))","v":""},{"$f":"IF($A$16=\"\",\"\",IF($A55<=MAX($A$16:$A$100),$A55,IF(AND(AO$2=MAX($A$16:$A$100),$A56=\"\"),\"Total\",\"\")))","v":""},{"$f":"IF($A$16=\"\",\"\",IF($A56<=MAX($A$16:$A$100),$A56,IF(AND(AP$2=MAX($A$16:$A$100),$A57=\"\"),\"Total\",\"\")))","v":""},{"$f":"IF($A$16=\"\",\"\",IF($A57<=MAX($A$16:$A$100),$A57,IF(AND(AQ$2=MAX($A$16:$A$100),$A58=\"\"),\"Total\",\"\")))","v":""},{"$f":"IF($A$16=\"\",\"\",IF($A58<=MAX($A$16:$A$100),$A58,IF(AND(AR$2=MAX($A$16:$A$100),$A59=\"\"),\"Total\",\"\")))","v":""},{"$f":"IF($A$16=\"\",\"\",IF($A59<=MAX($A$16:$A$100),$A59,IF(AND(AS$2=MAX($A$16:$A$100),$A60=\"\"),\"Total\",\"\")))","v":""},{"$f":"IF($A$16=\"\",\"\",IF($A60<=MAX($A$16:$A$100),$A60,IF(AND(AT$2=MAX($A$16:$A$100),$A61=\"\"),\"Total\",\"\")))","v":""},{"$f":"IF($A$16=\"\",\"\",IF($A61<=MAX($A$16:$A$100),$A61,IF(AND(AU$2=MAX($A$16:$A$100),$A62=\"\"),\"Total\",\"\")))","v":""},{"$f":"IF($A$16=\"\",\"\",IF($A62<=MAX($A$16:$A$100),$A62,IF(AND(AV$2=MAX($A$16:$A$100),$A63=\"\"),\"Total\",\"\")))","v":""},{"$f":"IF($A$16=\"\",\"\",IF($A63<=MAX($A$16:$A$100),$A63,IF(AND(AW$2=MAX($A$16:$A$100),$A64=\"\"),\"Total\",\"\")))","v":""},{"$f":"IF($A$16=\"\",\"\",IF($A64<=MAX($A$16:$A$100),$A64,IF(AND(AX$2=MAX($A$16:$A$100),$A65=\"\"),\"Total\",\"\")))","v":""},{"$f":"IF($A$16=\"\",\"\",IF($A65<=MAX($A$16:$A$100),$A65,IF(AND(AY$2=MAX($A$16:$A$100),$A66=\"\"),\"Total\",\"\")))","v":""},{"$f":"IF($A$16=\"\",\"\",IF($A66<=MAX($A$16:$A$100),$A66,IF(AND(AZ$2=MAX($A$16:$A$100),$A67=\"\"),\"Total\",\"\")))","v":""},{"$f":"IF($A$16=\"\",\"\",IF($A67<=MAX($A$16:$A$100),$A67,IF(AND(BA$2=MAX($A$16:$A$100),$A68=\"\"),\"Total\",\"\")))","v":""},{"$f":"IF($A$16=\"\",\"\",IF($A68<=MAX($A$16:$A$100),$A68,IF(AND(BB$2=MAX($A$16:$A$100),$A69=\"\"),\"Total\",\"\")))","v":""},{"$f":"IF($A$16=\"\",\"\",IF($A69<=MAX($A$16:$A$100),$A69,IF(AND(BC$2=MAX($A$16:$A$100),$A70=\"\"),\"Total\",\"\")))","v":""},{"$f":"IF($A$16=\"\",\"\",IF($A70<=MAX($A$16:$A$100),$A70,IF(AND(BD$2=MAX($A$16:$A$100),$A71=\"\"),\"Total\",\"\")))","v":""},{"$f":"IF($A$16=\"\",\"\",IF($A71<=MAX($A$16:$A$100),$A71,IF(AND(BE$2=MAX($A$16:$A$100),$A72=\"\"),\"Total\",\"\")))","v":""},{"$f":"IF($A$16=\"\",\"\",IF($A72<=MAX($A$16:$A$100),$A72,IF(AND(BF$2=MAX($A$16:$A$100),$A73=\"\"),\"Total\",\"\")))","v":""},{"$f":"IF($A$16=\"\",\"\",IF($A73<=MAX($A$16:$A$100),$A73,IF(AND(BG$2=MAX($A$16:$A$100),$A74=\"\"),\"Total\",\"\")))","v":""},{"$f":"IF($A$16=\"\",\"\",IF($A74<=MAX($A$16:$A$100),$A74,IF(AND(BH$2=MAX($A$16:$A$100),$A75=\"\"),\"Total\",\"\")))","v":""},{"$f":"IF($A$16=\"\",\"\",IF($A75<=MAX($A$16:$A$100),$A75,IF(AND(BI$2=MAX($A$16:$A$100),$A76=\"\"),\"Total\",\"\")))","v":""},{"$f":"IF($A$16=\"\",\"\",IF($A76<=MAX($A$16:$A$100),$A76,IF(AND(BJ$2=MAX($A$16:$A$100),$A100=\"\"),\"Total\",\"\")))","v":""},{"$f":"IF($A$16=\"\",\"\",IF($A77<=MAX($A$16:$A$100),$A77,IF(AND(BK$2=MAX($A$16:$A$100),$A100=\"\"),\"Total\",\"\")))","v":""},{"$f":"IF($A$16=\"\",\"\",IF($A78<=MAX($A$16:$A$100),$A78,IF(AND(BL$2=MAX($A$16:$A$100),$A100=\"\"),\"Total\",\"\")))","v":""},{"$f":"IF($A$16=\"\",\"\",IF($A79<=MAX($A$16:$A$100),$A79,IF(AND(BM$2=MAX($A$16:$A$100),$A100=\"\"),\"Total\",\"\")))","v":""},{"$f":"IF($A$16=\"\",\"\",IF($A80<=MAX($A$16:$A$100),$A80,IF(AND(BN$2=MAX($A$16:$A$100),$A100=\"\"),\"Total\",\"\")))","v":""},{"$f":"IF($A$16=\"\",\"\",IF($A81<=MAX($A$16:$A$100),$A81,IF(AND(BO$2=MAX($A$16:$A$100),$A100=\"\"),\"Total\",\"\")))","v":""},{"$f":"IF($A$16=\"\",\"\",IF($A82<=MAX($A$16:$A$100),$A82,IF(AND(BP$2=MAX($A$16:$A$100),$A100=\"\"),\"Total\",\"\")))","v":""},{"$f":"IF($A$16=\"\",\"\",IF($A83<=MAX($A$16:$A$100),$A83,IF(AND(BQ$2=MAX($A$16:$A$100),$A100=\"\"),\"Total\",\"\")))","v":""},{"$f":"IF($A$16=\"\",\"\",IF($A84<=MAX($A$16:$A$100),$A84,IF(AND(BR$2=MAX($A$16:$A$100),$A100=\"\"),\"Total\",\"\")))","v":""},{"$f":"IF($A$16=\"\",\"\",IF($A85<=MAX($A$16:$A$100),$A85,IF(AND(BS$2=MAX($A$16:$A$100),$A100=\"\"),\"Total\",\"\")))","v":""},{"$f":"IF($A$16=\"\",\"\",IF($A86<=MAX($A$16:$A$100),$A86,IF(AND(BT$2=MAX($A$16:$A$100),$A100=\"\"),\"Total\",\"\")))","v":""},{"$f":"IF($A$16=\"\",\"\",IF($A87<=MAX($A$16:$A$100),$A87,IF(AND(BU$2=MAX($A$16:$A$100),$A100=\"\"),\"Total\",\"\")))","v":""},{"$f":"IF($A$16=\"\",\"\",IF($A88<=MAX($A$16:$A$100),$A88,IF(AND(BV$2=MAX($A$16:$A$100),$A100=\"\"),\"Total\",\"\")))","v":""},{"$f":"IF($A$16=\"\",\"\",IF($A89<=MAX($A$16:$A$100),$A89,IF(AND(BW$2=MAX($A$16:$A$100),$A100=\"\"),\"Total\",\"\")))","v":""},{"$f":"IF($A$16=\"\",\"\",IF($A90<=MAX($A$16:$A$100),$A90,IF(AND(BX$2=MAX($A$16:$A$100),$A100=\"\"),\"Total\",\"\")))","v":""},{"$f":"IF($A$16=\"\",\"\",IF($A91<=MAX($A$16:$A$100),$A91,IF(AND(BY$2=MAX($A$16:$A$100),$A100=\"\"),\"Total\",\"\")))","v":""},{"$f":"IF($A$16=\"\",\"\",IF($A92<=MAX($A$16:$A$100),$A92,IF(AND(BZ$2=MAX($A$16:$A$100),$A100=\"\"),\"Total\",\"\")))","v":""},{"$f":"IF($A$16=\"\",\"\",IF($A93<=MAX($A$16:$A$100),$A93,IF(AND(CA$2=MAX($A$16:$A$100),$A100=\"\"),\"Total\",\"\")))","v":""},{"$f":"IF($A$16=\"\",\"\",IF($A94<=MAX($A$16:$A$100),$A94,IF(AND(CB$2=MAX($A$16:$A$100),$A100=\"\"),\"Total\",\"\")))","v":""},{"$f":"IF($A$16=\"\",\"\",IF($A95<=MAX($A$16:$A$100),$A95,IF(AND(CC$2=MAX($A$16:$A$100),$A100=\"\"),\"Total\",\"\")))","v":""},{"$f":"IF($A$16=\"\",\"\",IF($A96<=MAX($A$16:$A$100),$A96,IF(AND(CD$2=MAX($A$16:$A$100),$A100=\"\"),\"Total\",\"\")))","v":""},{"$f":"IF($A$16=\"\",\"\",IF($A97<=MAX($A$16:$A$100),$A97,IF(AND(CE$2=MAX($A$16:$A$100),$A100=\"\"),\"Total\",\"\")))","v":""},{"$f":"IF($A$16=\"\",\"\",IF($A98<=MAX($A$16:$A$100),$A98,IF(AND(CF$2=MAX($A$16:$A$100),$A100=\"\"),\"Total\",\"\")))","v":""},{"$f":"IF($A$16=\"\",\"\",IF($A99<=MAX($A$16:$A$100),$A99,IF(AND(CG$2=MAX($A$16:$A$100),$A100=\"\"),\"Total\",\"\")))","v":""},{"$f":"IF($A$16=\"\",\"\",IF($A100<=MAX($A$16:$A$100),$A100,IF(AND(BK$2=MAX($A$16:$A$100),$A101=\"\"),\"Total\",\"\")))","v":""}]
["Actual Cost"]
["Remaining Cost (Early)"]
["Remaining Cost (Late)"]
["At Completion Cost"]
["Cum At Completion Cost"]
["CURRENT UPDATE MONTHLY COST (EARNINGS) DATA "]
["Payment Estimate Dates",null,{"$f":"IF(C2=\"\",\"\",C2)","v":""},{"$f":"IF(D2=\"\",\"\",D2)","v":""},"","","","","","","","","","","","","","","","","","","","","","","","","","","","","","","","","","","","","","","","","","","","","","","","","","","","","","","","","","","","","","","","","","","","","","","","","","","","","","","","","","",""]
["Actual Cost"]
["Remaining Cost (Early)"]
["Remaining Cost (Late)"]
["At Completion Cost"]
["Cum At Completion Cost"]
["MONTHLY ESTIMATE DATES","BASELINE MONTHLY EARNINGS (EARLY)","BASELINE MONTHLY EARNINGS (LATE)","CURRENT PROJECTED MONTHLY EARNINGS","CURRENT UPDATE CUM AT COMPLETION COST","CURRENT ACTUAL/    PROJECTED CUM AT COMPLETION EARNINGS","CUM AT COMPLETION EARNINGS VARIANCE (COLUMN E - F)"]
{"$rows_left_out":86}
{"sheet":"Progress Chart","index":3,"n_rows":9,"n_cols":15,"rows_kept":9,"cut":false,"hidden":false,"merged":[[1,0,1,15],[3,0,3,1],[3,2,3,4],[3,11,3,13],[3,14,3,15],[2,0,2,15],[5,14,5,15],[3,5,8,10],[4,0,4,1],[4,2,4,4],[4,11,4,13],[4,14,4,15],[0,0,0,15],[8,0,8,1],[8,2,8,4],[8,11,8,13],[8,14,8,15],[7,0,7,1],[7,2,7,4],[7,11,7,13],[7,14,7,15],[6,0,6,1],[6,2,6,4],[6,11,6,13],[6,14,6,15],[5,0,5,1],[5,2,5,4],[5,11,5,13]]}
[{"$f":"IF('Controls Chart Data'!A1:O1=\"\",\"\",'Controls Chart Data'!A1:O1)","v":"Enter Company Name Here"}]
["CONTRACTOR'S PROGRESS EARNINGS S-CURVE"]
[{"$f":"IF('Controls Chart Data'!A3:O3=\"\",\"\",'Controls Chart Data'!A3:O3)","v":"Enter Submission Number and Data Date Here (i.e. Baseline #01, DD: 9-01-19)"}]
["CONTRACT ID. NO.:",null,{"$f":"IF('Controls Chart Data'!C4:I4=\"\",\"\",'Controls Chart Data'!C4:H4)","v":""},null,null,null,null,null,null,null,null,{"$f":"'Controls Chart Data'!K4","v":"CONTRACT NTP DATE:"},null,null,{"$f":"IF('Controls Chart Data'!N4=\"\",\"\",'Controls Chart Data'!N4)","v":""}]
["PROJECT NO.:",null,{"$f":"IF('Controls Chart Data'!C5:I5=\"\",\"\",'Controls Chart Data'!C5:H5)","v":""},null,null,null,null,null,null,null,null,{"$f":"'Controls Chart Data'!K5","v":"CONTRACT COMPLETION DATE:"},null,null,{"$f":"IF('Controls Chart Data'!N5=\"\",\"\",'Controls Chart Data'!N5)","v":""}]
["FHWA PROJECT NO.:",null,{"$f":"IF('Controls Chart Data'!C6:I6=\"\",\"\",'Controls Chart Data'!C6:H6)","v":""},null,null,null,null,null,null,null,null,{"$f":"'Controls Chart Data'!K6","v":"PROJECTED COMPLETION DATE:"},null,null,{"$f":"IF('Controls Chart Data'!N6=\"\",\"\",'Controls Chart Data'!N6)","v":""}]
["PROJECT NAME:",null,{"$f":"IF('Controls Chart Data'!C7:I7=\"\",\"\",'Controls Chart Data'!C7:H7)","v":""},null,null,null,null,null,null,null,null,{"$f":"'Controls Chart Data'!K7","v":"ORIGINAL TOTAL CONTRACT VALUE:"},null,null,{"$f":"IF('Controls Chart Data'!N7=\"\",\"\",'Controls Chart Data'!N7)","v":""}]
["ROUTE:",null,{"$f":"IF('Controls Chart Data'!C8:I8=\"\",\"\",'Controls Chart Data'!C8:H8)","v":""},null,null,null,null,null,null,null,null,{"$f":"'Controls Chart Data'!K8","v":"ADJUSTED TOTAL CONTRACT VALUE:"},null,null,{"$f":"IF('Controls Chart Data'!N8=\"\",\"\",'Controls Chart Data'!N8)","v":""}]
["CITY/COUNTY:",null,{"$f":"IF('Controls Chart Data'!C9:I9=\"\",\"\",'Controls Chart Data'!C9:H9)","v":""},null,null,null,null,null,null,null,null,{"$f":"'Controls Chart Data'!K10","v":"CURRENT PROGRESS ESTIMATE DATE:"},null,null,{"$f":"IF('Controls Chart Data'!N10=\"\",\"\",'Controls Chart Data'!N10)","v":""}]